{"text_format":"2","workbook":"xlsx","n_sheets":4,"sheets":["GERAL","Atividade 1 - metodologias","Atividade 2 - google app engine","Projeto"],"not_rendered":{"charts":0,"images":0,"macros":0,"external_links":0,"defined_names":0,"comments":0,"pivot_tables":0},"unopened":[],"bounds":{"document_bytes":16777216,"sheet_cells":100000,"run_cost":"one","rows_first":2000,"rows_last":500,"rows_between":2000,"halvings":0,"cell_chars":16384,"cell_head_chars":4096},"cells_cut":0,"cells_raw":0,"read":"whole","date_system":"1900"}

{"sheet":"GERAL","index":0,"n_rows":14,"n_cols":15,"rows_kept":14,"cut":false,"hidden":false,"merged":[[2,1,2,3],[2,4,2,6],[2,7,2,9],[0,0,0,14],[1,0,1,14]]}
["             UNIVERSIDADE FEDERAL  RURAL  DE  PERNAMBUCO\n         DEPARTAMENTO DE ESTATÍSTICA E INFORMÁTICA\nBACHARELADO EM SISTEMAS DE INFORMAÇÃO"]
["TÓPICOS EM ENGENHARIA DE SOFTWARE – 2011.2\nProf. Andreza Leite de Alencar"]
[null,"1º VA",null,null,"2º VA",null,null,"3º V A",null,null,"MÉDIA","SIT PARCIAL","FINAL","MÉDIA PÓS FINAL","SITUAÇÃO FINAL"]
["Nomes","Prova","Atividade 1","Média","Projeto","Atividade 2","Média","Prova","Atividade","Média","1º e 2º VA",null,"Prova","Nota ","Situação"]
["BLENDA ÚLIMA RODRIGUES CESAR GUEDES","F","F",{"$f":"ROUNDUP((IF(C5=(\"F\"),0,C5*0.3)+(IF(B5=(\"F\"),0,B5*0.7))),1)","v":0},0,0,{"$f":"ROUNDUP((IF(F5=(\"F\"),0,F5*0.3)+(IF(E5=(\"F\"),0,E5*0.7))),1)","v":0},null,null,{"$f":"ROUNDUP((IF(I5=(\"F\"),0,I5*0.3)+(IF(H5=(\"F\"),0,H5*0.7))),1)","v":0},{"$f":"(D5+G5)/2","v":0},{"$f":"IF(K5>=7,\"AM\",IF(K5>=3,\"Rec\",\"RD\"))","v":"RD"},null,{"$f":"IF(M5=(\"F\"),K5/2,IF(K5>=7,\"-\",IF(K5<3,\"-\",IF(L5=\"Aprov\",\"\",(K5+M5)/2))))","v":"-"},{"$f":"IF(K5>=7,\"AM\",IF(K5<3,\"Reprov\",IF(L5=\"AM\",\"\",IF(N5>=7,\"AF\",\"Reprov\"))))","v":"Reprov"}]
["BRUNA REGINA DE ALMEIDA CHAGAS",10,9.5,{"$f":"ROUNDUP((IF(C6=(\"F\"),0,C6*0.3)+(IF(B6=(\"F\"),0,B6*0.7))),1)","v":9.9},10,10,{"$f":"ROUNDUP((IF(F6=(\"F\"),0,F6*0.3)+(IF(E6=(\"F\"),0,E6*0.7))),1)","v":10},null,null,{"$f":"ROUNDUP((IF(I6=(\"F\"),0,I6*0.3)+(IF(H6=(\"F\"),0,H6*0.7))),1)","v":0},{"$f":"(D6+G6)/2","v":9.9499999999999993},{"$f":"IF(K6>=7,\"AM\",IF(K6>=3,\"Rec\",\"RD\"))","v":"AM"},null,{"$f":"IF(M6=(\"F\"),K6/2,IF(K6>=7,\"-\",IF(K6<3,\"-\",IF(L6=\"Aprov\",\"\",(K6+M6)/2))))","v":"-"},{"$f":"IF(K6>=7,\"AM\",IF(K6<3,\"Reprov\",IF(L6=\"AM\",\"\",IF(N6>=7,\"AF\",\"Reprov\"))))","v":"AM"}]
["DANIEL FILYPE SILVA BARRETO",9.5,9.5,{"$f":"ROUNDUP((IF(C7=(\"F\"),0,C7*0.3)+(IF(B7=(\"F\"),0,B7*0.7))),1)","v":9.5},10,10,{"$f":"ROUNDUP((IF(F7=(\"F\"),0,F7*0.3)+(IF(E7=(\"F\"),0,E7*0.7))),1)","v":10},null,null,{"$f":"ROUNDUP((IF(I7=(\"F\"),0,I7*0.3)+(IF(H7=(\"F\"),0,H7*0.7))),1)","v":0},{"$f":"(D7+G7)/2","v":9.75},{"$f":"IF(K7>=7,\"AM\",IF(K7>=3,\"Rec\",\"RD\"))","v":"AM"},null,{"$f":"IF(M7=(\"F\"),K7/2,IF(K7>=7,\"-\",IF(K7<3,\"-\",IF(L7=\"AM\",\"\",(K7+M7)/2))))","v":"-"},{"$f":"IF(K7>=7,\"AM\",IF(K7<3,\"Reprov\",IF(L7=\"AM\",\"\",IF(N7>=7,\"AF\",\"Reprov\"))))","v":"AM"}]
["DEYVISON JOSÉ DA COSTA","F","F",{"$f":"ROUNDUP((IF(C8=(\"F\"),0,C8*0.3)+(IF(B8=(\"F\"),0,B8*0.7))),1)","v":0},0,0,0,null,null,0,{"$f":"(D8+G8)/2","v":0},"RD",null,{"$f":"IF(M8=(\"F\"),K8/2,IF(K8>=7,\"-\",IF(K8<3,\"-\",IF(L8=\"AM\",\"\",(K8+M8)/2))))","v":"-"},"Reprov"]
["ELIZANGELA DE LIMA LUCENA",8.75,9.5,9,10,10,10,null,null,0,9.5,"AM",null,"-","AM"]
["ESDRAS MARTINS DE OLIVEIRA","F","F",0,0,0,0,null,null,0,0,"RD",null,"-","Reprov"]
["LUIZ FELIPE RIBEIRO DE ARRUDA","F","F",0,0,0,0,null,null,0,0,"RD",null,"-","Reprov"]
["MATHEUS BENÍCIO RODRIGUES EVANGELISTA",10,10,10,10,10,10,null,null,0,{"$f":"(D12+G12)/2","v":10},"AM",null,{"$f":"IF(M12=(\"F\"),K12/2,IF(K12>=7,\"-\",IF(K12<3,\"-\",IF(L12=\"AM\",\"\",(K12+M12)/2))))","v":"-"},"AM"]
[]
[null,"Legenda:  AM: Aprovado por Média     RD: Reprovado Direto     Rec: Recuperação     AF: Aprovado na Final"]

{"sheet":"Atividade 1 - metodologias","index":1,"n_rows":9,"n_cols":10,"rows_kept":9,"cut":false,"hidden":false,"merged":[]}
["Nomes","apresentação","postura","domínio","segurança","tempo","conteúdo","pratica","OBS","NOTA"]
["BLENDA ÚLIMA RODRIGUES CESAR GUEDES",0,0,0,0,0,0,0,"faltou",{"$f":"SUM(B2:H2)","v":0}]
["BRUNA REGINA DE ALMEIDA CHAGAS",1.5,1,1,1,1,2,2,null,{"$f":"SUM(B3:H3)","v":9.5}]
["DANIEL FILYPE SILVA BARRETO",1.5,1,1,1,1,2,2,null,9.5]
["DEYVISON JOSÉ DA COSTA",0,0,0,0,0,0,0,"faltou",0]
["ELIZANGELA DE LIMA LUCENA",2,1,1,1,1,2,1.5,null,9.5]
["ESDRAS MARTINS DE OLIVEIRA",0,0,0,0,0,0,0,"faltou",0]
["LUIZ FELIPE RIBEIRO DE ARRUDA",0,0,0,0,0,0,0,"faltou",0]
["MATHEUS BENÍCIO RODRIGUES VANGELISTA",2,1,1,1,1,2,2,null,10]

{"sheet":"Atividade 2 - google app engine","index":2,"n_rows":9,"n_cols":3,"rows_kept":9,"cut":false,"hidden":false,"merged":[]}
["Nomes","entregue s/n","NOTA"]
["BLENDA ÚLIMA RODRIGUES CESAR GUEDES","NÃO",{"$f":"IF(B2=\"sim\",10,0)","v":0}]
["BRUNA REGINA DE ALMEIDA CHAGAS","SIM",{"$f":"IF(B3=\"sim\",10,0)","v":10}]
["DANIEL FILYPE SILVA BARRETO","SIM",10]
["DEYVISON JOSÉ DA COSTA","NÃO",0]
["ELIZANGELA DE LIMA LUCENA","SIM",10]
["ESDRAS MARTINS DE OLIVEIRA","NÃO",0]
["LUIZ FELIPE RIBEIRO DE ARRUDA","NÃO",0]
["MATHEUS BENÍCIO RODRIGUES VANGELISTA","SIM",10]

{"sheet":"Projeto","index":3,"n_rows":9,"n_cols":9,"rows_kept":9,"cut":false,"hidden":false,"merged":[]}
["Nomes","apresentação","atend.requisitos","processo","artefatos docs","aplicação","participação","OBS","NOTA"]
["BLENDA ÚLIMA RODRIGUES CESAR GUEDES",0,0,0,0,0,0,null,{"$f":"SUM(B2:G2)","v":0}]
["BRUNA REGINA DE ALMEIDA CHAGAS",1,2,3,1,2,1,null,{"$f":"SUM(B3:G3)","v":10}]
["DANIEL FILYPE SILVA BARRETO",1,2,3,1,2,1,null,10]
["DEYVISON JOSÉ DA COSTA",0,0,0,0,0,0,null,0]
["ELIZANGELA DE LIMA LUCENA",1,2,3,1,2,1,null,10]
["ESDRAS MARTINS DE OLIVEIRA",0,0,0,0,0,0,null,0]
["LUIZ FELIPE RIBEIRO DE ARRUDA",0,0,0,0,0,0,null,0]
["MATHEUS BENÍCIO RODRIGUES VANGELISTA",1,2,3,1,2,1,null,10]